/libcore/harmony-tests/src/test/java/org/apache/harmony/tests/java/lang/ |
AbstractMethodErrorTest.java | 29 Error error = new AbstractMethodError(); local 30 assertNull(error.getCause()); 31 assertNull(error.getMessage()); 39 Error error = new AbstractMethodError(null); local 40 assertNull(error.getMessage()); 41 assertNull(error.getCause()); 43 error = new AbstractMethodError("msg"); 44 assertEquals("msg", error.getMessage()) [all...] |
/bionic/libc/upstream-netbsd/lib/libc/gen/ |
ftw.c | 45 int fnflag, error, sverrno; local 56 error = 0; 84 error = -1; 87 error = fn(cur->fts_path, cur->fts_statp, fnflag); 88 if (error != 0) 93 if (fts_close(ftsp) != 0 && error == 0) 94 error = -1; 97 return (error);
|
/cts/tests/tests/net/src/android/net/http/cts/ |
SslErrorTest.java | 37 SslError error = new SslError(SslError.SSL_EXPIRED, mCertificate); local 38 assertTrue(error.hasError(SslError.SSL_EXPIRED)); 39 assertFalse(error.hasError(SslError.SSL_UNTRUSTED)); 43 SslError error = new SslError(SslError.SSL_EXPIRED, mCertificate); local 44 assertFalse(error.hasError(SslError.SSL_UNTRUSTED)); 45 error.addError(SslError.SSL_UNTRUSTED); 46 assertTrue(error.hasError(SslError.SSL_UNTRUSTED)); 50 SslError error = new SslError(SslError.SSL_EXPIRED, mCertificate); local 51 error.addError(42); 52 assertFalse(error.hasError(42)) 56 SslError error = new SslError(42, mCertificate); local 61 SslError error = new SslError(SslError.SSL_EXPIRED, mCertificate); local 67 SslError error = new SslError(42, mCertificate); local 72 SslError error = new SslError(SslError.SSL_EXPIRED, mCertificate, "foo"); local 77 SslError error = new SslError(SslError.SSL_EXPIRED, mCertificate); local [all...] |
/cts/tests/tests/opengl/libopengltest/ |
attach_shader_eight.cpp | 31 GLint error = glGetError(); local 32 Data data = {error, -9 , -1};
|
attach_shader_nine.cpp | 30 GLint error = glGetError(); local 31 Data data = {error, -9, -1};
|
/development/host/windows/usb/api/ |
adb_legacy_io_completion.cpp | 62 ULONG error = GetLastError();
local 65 ((ERROR_IO_INCOMPLETE == error) || (ERROR_IO_PENDING == error))) {
73 error = GetLastError();
75 ((ERROR_IO_INCOMPLETE != error) && (ERROR_IO_PENDING != error))) {
|
/external/antlr/antlr-3.4/tool/src/main/java/org/antlr/tool/ |
ANTLRErrorListener.java | 30 /** Defines behavior of object able to handle error messages from ANTLR including 33 * wrapping error data in Message objects and passing them to the listener. 35 * the info I need for error messages. 39 public void error(Message msg); method in interface:ANTLRErrorListener 41 public void error(ToolMessage msg); method in interface:ANTLRErrorListener
|
/external/bison/examples/calc++/ |
calc++-driver.cc | 29 calcxx_driver::error (const yy::location& l, const std::string& m) function in class:calcxx_driver 35 calcxx_driver::error (const std::string& m) function in class:calcxx_driver
|
/external/clang/test/Analysis/ |
NewDeleteLeaks-PR18394.cpp | 13 void error() { function
|
/external/easymock/src/org/easymock/internal/ |
AssertionErrorWrapper.java | 22 private final AssertionError error;
field in class:AssertionErrorWrapper 24 public AssertionErrorWrapper(AssertionError error) {
25 this.error = error;
29 return error;
|
/external/freetype/src/base/ |
basepic.c | 72 FT_Error error = FT_Err_Ok; local 79 return error; 84 error = ft_create_default_module_classes( library ); 85 if ( error ) 100 if ( error ) 102 return error;
|
ftsnames.c | 47 FT_Error error = FT_ERR( Invalid_Argument ); local 83 error = FT_Err_Ok; 87 return error;
|
/external/freetype/src/cff/ |
cffpic.c | 91 FT_Error error = FT_Err_Ok; local 98 return error; 104 error = FT_Create_Class_cff_services( library, 106 if ( error ) 109 error = FT_Create_Class_cff_field_handlers( 111 if ( error ) 130 if ( error ) 132 return error;
|
/external/freetype/src/pshinter/ |
pshpic.c | 52 FT_Error error = FT_Err_Ok; local 59 return error; 67 if ( error ) 70 return error;
|
/external/freetype/src/psnames/ |
pspic.c | 67 FT_Error error = FT_Err_Ok; local 74 return error; 80 error = FT_Create_Class_pscmaps_services( 82 if ( error ) 88 if ( error ) 90 return error;
|
/external/freetype/src/sfnt/ |
sfntpic.c | 98 FT_Error error = FT_Err_Ok; local 105 return error; 111 error = FT_Create_Class_sfnt_services( library, 113 if ( error ) 116 error = FT_Create_Class_tt_cmap_classes( library, 118 if ( error ) 135 if ( error ) 137 return error;
|
/external/freetype/src/truetype/ |
ttpic.c | 68 FT_Error error = FT_Err_Ok; local 75 return error; 81 error = FT_Create_Class_tt_services( library, 83 if ( error ) 93 if ( error ) 95 return error;
|
/external/libpcap/tests/ |
reactivatetest.c | 35 static void error(const char *, ...); 48 error("Neither lo0 nor lo could be opened: %s", 56 error("pcap_activate() of opened pcap_t succeeded"); 58 error("pcap_activate() of opened pcap_t failed with %s, not PCAP_ERROR_ACTIVATED", 61 error("pcap_activate() of opened pcap_t failed with %s, not PCAP_ERROR_ACTIVATED", 69 error(const char *fmt, ...) function
|
/external/lldb/source/Interpreter/ |
OptionGroupBoolean.cpp | 44 Error 49 Error error; local 58 error = m_value.SetValueFromCString (option_arg); 60 return error;
|
OptionValueArch.cpp | 45 Error 48 Error error; local 62 error.SetErrorStringWithFormat("unsupported architecture '%s'", value_cstr); 66 error.SetErrorString("invalid value string"); 75 error = OptionValue::SetValueFromCString (value_cstr, op); 78 return error;
|
OptionValueRegex.cpp | 43 Error 47 Error error; local 55 error = OptionValue::SetValueFromCString (value_cstr, op); 72 error.SetErrorString (regex_error); 74 error.SetErrorStringWithFormat ("regex error %u", m_regex.GetErrorCode()); 78 return error;
|
OptionValueSInt64.cpp | 38 Error 42 Error error; local 62 error.SetErrorStringWithFormat ("%" PRIi64 " is out of range, valid values must be between %" PRIi64 " and %" PRIi64 ".", 69 error.SetErrorStringWithFormat ("invalid int64_t string value: '%s'", value_cstr); 79 error = OptionValue::SetValueFromCString (value_cstr, op); 82 return error;
|
OptionValueUInt64.cpp | 23 OptionValueUInt64::Create (const char *value_cstr, Error &error) 26 error = value_sp->SetValueFromCString (value_cstr); 27 if (error.Fail()) 46 Error 49 Error error; local 68 error.SetErrorStringWithFormat ("invalid uint64_t string value: '%s'", value_cstr); 78 error = OptionValue::SetValueFromCString (value_cstr, op); 81 return error; [all...] |
/external/mesa3d/src/gallium/state_trackers/vega/ |
api_context.c | 39 VGErrorCode error = VG_NO_CONTEXT_ERROR; local 42 return error; 44 error = ctx->_error; 47 return error;
|
/external/pdfium/third_party/freetype/src/base/ |
basepic.c | 72 FT_Error error = FT_Err_Ok; local 79 return error; 84 error = ft_create_default_module_classes( library ); 85 if ( error ) 100 if ( error ) 102 return error;
|