HomeSort by relevance Sort by last modified time
    Searched full:exited (Results 401 - 425 of 2880) sorted by null

<<11121314151617181920>>

  /external/valgrind/none/tests/amd64/
allexec.c 17 else S("child exited\n"); \
  /external/valgrind/none/tests/arm/
allexec.c 17 else S("child exited\n"); \
  /external/valgrind/none/tests/arm64/
allexec.c 17 else S("child exited\n"); \
  /external/valgrind/none/tests/mips32/
allexec.c 17 else S("child exited\n"); \
  /external/valgrind/none/tests/mips64/
allexec.c 17 else S("child exited\n"); \
  /external/valgrind/none/tests/ppc32/
allexec.c 17 else S("child exited\n"); \
  /external/valgrind/none/tests/ppc64/
allexec.c 17 else S("child exited\n"); \
  /external/valgrind/none/tests/s390x/
allexec.c 17 else S("child exited\n"); \
  /external/valgrind/none/tests/solaris/
mmap_noreserve.c 84 fprintf(stderr, "FAILED: child exited with unexpected status %s %d\n",
  /external/valgrind/none/tests/x86/
allexec.c 17 else S("child exited\n"); \
  /frameworks/base/core/java/com/android/internal/util/
IState.java 44 * Called when a state is exited.
  /frameworks/native/services/vr/bufferhubd/
bufferhubd.cpp 50 CHECK_ERROR(ret < 0, error, "Dispatch loop exited because: %s\n",
  /frameworks/rs/tests/lldb/tests/testcases/
test_invoke_fun.py 69 self.try_command('process continue', ['exited with status = 0'])
test_rs_consts.py 93 self.try_command('process continue', ['exited with status = 0'])
  /prebuilts/go/darwin-x86/src/cmd/internal/browser/
browser.go 54 // If the command runs within the timeout, it's deemed successful if it exited cleanly.
  /prebuilts/go/darwin-x86/src/sync/
waitgroup_test.go 19 exited := make(chan bool, n)
24 exited <- true
30 case <-exited:
37 <-exited // Will block if barrier fails to unlock someone.
  /prebuilts/go/linux-x86/src/cmd/internal/browser/
browser.go 54 // If the command runs within the timeout, it's deemed successful if it exited cleanly.
  /prebuilts/go/linux-x86/src/sync/
waitgroup_test.go 19 exited := make(chan bool, n)
24 exited <- true
30 case <-exited:
37 <-exited // Will block if barrier fails to unlock someone.
  /system/extras/simpleperf/
workload_test.cpp 81 "child process exited with exit code");
  /tools/dexter/slicer/export/slicer/
scopeguard.h 32 // regardless of how the scope is exited
  /external/guava/guava-tests/test/com/google/common/util/concurrent/
AbstractFutureTest.java 118 errorMessage.set("Set call exited before future was complete.");
127 errorMessage.set("SetException call exited before future was complete.");
136 errorMessage.set("Cancel call exited before future was complete.");
  /external/ltp/testcases/kernel/syscalls/execve/
execve05.c 150 tst_resm(TFAIL, "child exited abnormally");
173 tst_resm(TFAIL, "child exited abnormally");
179 "leftover children haven't exited yet");
  /external/ltp/testcases/kernel/syscalls/setsid/
setsid01.c 120 "Test {%d} exited "
131 tst_resm(TFAIL, "Test {%d} exited "
196 "Test {%d} exited status 0x%-x (wanted 0x9)",
  /external/ltp/testcases/open_posix_testsuite/conformance/interfaces/sem_unlink/
2-2.c 224 FAILED("Child 'sem_close' exited abnormally");
234 FAILED("Child '_exit' exited abnormally");
244 FAILED("Child 'exec' exited abnormally");
  /external/strace/
wait.c 67 int exited = 0; local
88 exited = 1;
115 return exited;

Completed in 3611 milliseconds

<<11121314151617181920>>