HomeSort by relevance Sort by last modified time
    Searched full:exited (Results 826 - 850 of 2880) sorted by null

<<31323334353637383940>>

  /external/antlr/antlr-3.4/gunit/
CHANGES.txt 90 * fixed bug: program exited upon InvocationTargetException
  /external/apache-harmony/jdwp/src/test/java/org/apache/harmony/jpda/tests/jdwp/ThreadReference/
Status005Debuggee.java 76 ("--> Debuggee: Status005Debuggee: has exited from synchronized(lockObject) block");
  /external/autotest/client/cros/image_comparison/
pdiff_image_comparer.py 86 # pdiff exited with 0, images were the same
  /external/autotest/server/cros/
remote_command.py 82 # Ignore status because the command may have exited already
  /external/autotest/server/site_tests/network_WiFi_Reset/
network_WiFi_Reset.py 127 logging.info("Test exited, but interface is missing; rebooting")
  /external/autotest/venv/lucifer/
eventlib.py 85 logger.debug('Event command child with pid %d exited with %d',
  /external/chromium-trace/catapult/devil/devil/android/
forwarder.py 175 '`%s` exited with %d:\n%s' % (
227 '`%s` exited with %d' % (' '.join(unmap_all_cmd), exit_code)]
331 '`%s` exited with %d:\n%s',
434 '%s exited with %d:\n%s' % (
  /external/kernel-headers/original/uapi/linux/
ivtv.h 38 When you close the file handle the user DMA mode is exited again.
  /external/llvm/tools/llvm-diff/
DiffConsumer.h 40 /// Record that a local context has been exited.
  /external/ltp/testcases/kernel/containers/pidns/
pidns01.c 110 tst_resm(TFAIL, "child exited abnormally");
pidns04.c 136 tst_resm(TFAIL, "Container init pid exited abnormally");
pidns17.c 154 tst_resm(TFAIL, "container exited abnormally");
  /external/ltp/testcases/kernel/ipc/semaphore/
sem01.c 148 printf("child exited with status\n");
  /external/ltp/testcases/kernel/syscalls/alarm/
alarm07.c 129 "child exited abnormally");
  /external/ltp/testcases/kernel/syscalls/nanosleep/
nanosleep03.c 93 tst_resm(TFAIL, "child process exited abnormally; "
  /external/ltp/testcases/open_posix_testsuite/conformance/interfaces/fork/
1-1.c 130 UNRESOLVED(status, "Child exited abnormally");
13-1.c 154 FAILED("Child exited abnormally");
14-1.c 120 FAILED("Child exited abnormally");
17-1.c 123 FAILED("Child exited abnormally");
17-2.c 154 FAILED("Child exited abnormally");
18-1.c 137 FAILED("Child exited abnormally");
21-1.c 124 FAILED("Child exited abnormally");
22-1.c 176 FAILED("Child exited abnormally");
6-1.c 138 FAILED("Child exited abnormally -- dir stream not copied?");
7-1.c 154 FAILED("Child exited abnormally");

Completed in 1275 milliseconds

<<31323334353637383940>>