Home | History | Annotate | Download | only in tradefed_test_unittest_data
      1 03-13 22:29:05 I/ModuleRepo: chromeos2-row4-rack7-host11:22 running 1 modules, expected to complete in 3m 15s
      2 03-13 22:29:05 I/CompatibilityTest: Starting 1 module on chromeos2-row4-rack7-host11:22
      3 03-13 22:29:05 D/ConfigurationFactory: Loading configuration 'system-status-checkers'
      4 03-13 22:29:05 I/CompatibilityTest: Running system status checker before module execution: CtsSecurityTestCases
      5 03-13 22:29:05 D/ModuleDef: Preparer: ApkInstaller
      6 03-13 22:29:05 D/TestAppInstallSetup: Installing apk from /tmp/autotest-tradefed-install_NSzXkp/6788ea8941996ab9d36f560c87b93484/android-cts-7.1_r3-linux_x86-arm/android-cts/tools/../../android-cts/testcases/CtsSecurityTestCases.apk ...
      7 03-13 22:29:05 D/CtsSecurityTestCases.apk: Uploading CtsSecurityTestCases.apk onto device 'chromeos2-row4-rack7-host11:22'
      8 03-13 22:29:05 D/Device: Uploading file onto device 'chromeos2-row4-rack7-host11:22'
      9 03-13 22:29:14 D/RunUtil: Running command with timeout: 60000ms
     10 03-13 22:29:14 D/RunUtil: Running [aapt, dump, badging, /tmp/autotest-tradefed-install_NSzXkp/6788ea8941996ab9d36f560c87b93484/android-cts-7.1_r3-linux_x86-arm/android-cts/tools/../../android-cts/testcases/CtsSecurityTestCases.apk]
     11 03-13 22:29:15 D/ModuleDef: Test: AndroidJUnitTest
     12 03-13 22:29:15 W/InstrumentationTest: shell-timeout should be larger than test-timeout 900000; NOTE: extending shell-timeout to 990000, please consider fixing this!
     13 03-13 22:29:15 D/InstrumentationTest: Collecting test info for android.security.cts on device chromeos2-row4-rack7-host11:22
     14 03-13 22:29:15 I/RemoteAndroidTest: Running am instrument -w -r --abi armeabi-v7a  -e testFile /data/local/tmp/ajur/includes.txt -e debug false -e log true -e notTestFile /data/local/tmp/ajur/excludes.txt -e timeout_msec 900000 android.security.cts/android.support.test.runner.AndroidJUnitRunner on google-reef-chromeos2-row4-rack7-host11:22
     15 03-13 22:29:18 I/RemoteAndroidTest: Running am instrument -w -r --abi armeabi-v7a  -e testFile /data/local/tmp/ajur/includes.txt -e debug false -e log false -e notTestFile /data/local/tmp/ajur/excludes.txt -e timeout_msec 900000 android.security.cts/android.support.test.runner.AndroidJUnitRunner on google-reef-chromeos2-row4-rack7-host11:22
     16 03-13 22:29:19 D/ModuleListener: ModuleListener.testRunStarted(android.security.cts, 110)
     17 03-13 22:29:19 I/ConsoleReporter: [chromeos2-row4-rack7-host11:22] Starting armeabi-v7a CtsSecurityTestCases with 110 tests
     18 03-13 22:29:19 D/ModuleListener: ModuleListener.testStarted(android.security.cts.ARTBootASLRTest#testARTASLR)
     19 03-13 22:29:19 D/ModuleListener: ModuleListener.testEnded(android.security.cts.ARTBootASLRTest#testARTASLR, {})
     20 03-13 22:29:19 I/ConsoleReporter: [1/110 armeabi-v7a CtsSecurityTestCases chromeos2-row4-rack7-host11:22] android.security.cts.ARTBootASLRTest#testARTASLR pass
     21 03-13 22:29:19 D/ModuleListener: ModuleListener.testStarted(android.security.cts.ActivityManagerTest#testActivityManager_injectInputEvents)
     22 03-13 22:29:19 D/ModuleListener: ModuleListener.testEnded(android.security.cts.ActivityManagerTest#testActivityManager_injectInputEvents, {})
     23 03-13 22:29:19 I/ConsoleReporter: [2/110 armeabi-v7a CtsSecurityTestCases chromeos2-row4-rack7-host11:22] android.security.cts.ActivityManagerTest#testActivityManager_injectInputEvents pass
     24 03-13 22:29:19 D/ModuleListener: ModuleListener.testStarted(android.security.cts.AllocatePixelRefIntOverflowTest#testAllocateJavaPixelRefIntOverflow)
     25 03-13 22:29:19 D/ModuleListener: ModuleListener.testEnded(android.security.cts.AllocatePixelRefIntOverflowTest#testAllocateJavaPixelRefIntOverflow, {})
     26 03-13 22:29:19 I/ConsoleReporter: [3/110 armeabi-v7a CtsSecurityTestCases chromeos2-row4-rack7-host11:22] android.security.cts.AllocatePixelRefIntOverflowTest#testAllocateJavaPixelRefIntOverflow pass
     27 03-13 22:29:20 D/ModuleListener: ModuleListener.testStarted(android.security.cts.AslrTest#testOneExecutableIsPie)
     28 03-13 22:29:20 D/ModuleListener: ModuleListener.testEnded(android.security.cts.AslrTest#testOneExecutableIsPie, {})
     29 03-13 22:29:20 I/ConsoleReporter: [4/110 armeabi-v7a CtsSecurityTestCases chromeos2-row4-rack7-host11:22] android.security.cts.AslrTest#testOneExecutableIsPie pass
     30 03-13 22:29:20 D/ModuleListener: ModuleListener.testStarted(android.security.cts.AslrTest#testRandomization)
     31 03-13 22:29:38 D/ModuleListener: ModuleListener.testEnded(android.security.cts.AslrTest#testRandomization, {})
     32 03-13 22:29:38 I/ConsoleReporter: [5/110 armeabi-v7a CtsSecurityTestCases chromeos2-row4-rack7-host11:22] android.security.cts.AslrTest#testRandomization pass
     33 03-13 22:29:38 D/ModuleListener: ModuleListener.testStarted(android.security.cts.AslrTest#testVaRandomize)
     34 03-13 22:29:38 D/ModuleListener: ModuleListener.testEnded(android.security.cts.AslrTest#testVaRandomize, {})
     35 03-13 22:29:38 I/ConsoleReporter: [6/110 armeabi-v7a CtsSecurityTestCases chromeos2-row4-rack7-host11:22] android.security.cts.AslrTest#testVaRandomize pass
     36 03-13 22:29:38 D/ModuleListener: ModuleListener.testStarted(android.security.cts.BannedFilesTest#testNoCmdClient)
     37 03-13 22:29:38 D/ModuleListener: ModuleListener.testEnded(android.security.cts.BannedFilesTest#testNoCmdClient, {})
     38 03-13 22:29:38 I/ConsoleReporter: [7/110 armeabi-v7a CtsSecurityTestCases chromeos2-row4-rack7-host11:22] android.security.cts.BannedFilesTest#testNoCmdClient pass
     39 03-13 22:29:38 D/ModuleListener: ModuleListener.testStarted(android.security.cts.BannedFilesTest#testNoEnableRoot)
     40 03-13 22:29:38 D/ModuleListener: ModuleListener.testEnded(android.security.cts.BannedFilesTest#testNoEnableRoot, {})
     41 03-13 22:29:38 I/ConsoleReporter: [8/110 armeabi-v7a CtsSecurityTestCases chromeos2-row4-rack7-host11:22] android.security.cts.BannedFilesTest#testNoEnableRoot pass
     42 03-13 22:29:38 D/ModuleListener: ModuleListener.testStarted(android.security.cts.BannedFilesTest#testNoRootCmdSocket)
     43 03-13 22:29:39 D/ModuleListener: ModuleListener.testEnded(android.security.cts.BannedFilesTest#testNoRootCmdSocket, {})
     44 03-13 22:29:39 I/ConsoleReporter: [9/110 armeabi-v7a CtsSecurityTestCases chromeos2-row4-rack7-host11:22] android.security.cts.BannedFilesTest#testNoRootCmdSocket pass
     45 03-13 22:29:39 D/ModuleListener: ModuleListener.testStarted(android.security.cts.BannedFilesTest#testNoSetuidIp)
     46 03-13 22:29:39 D/ModuleListener: ModuleListener.testEnded(android.security.cts.BannedFilesTest#testNoSetuidIp, {})
     47 03-13 22:29:39 I/ConsoleReporter: [10/110 armeabi-v7a CtsSecurityTestCases chromeos2-row4-rack7-host11:22] android.security.cts.BannedFilesTest#testNoSetuidIp pass
     48 03-13 22:29:39 D/ModuleListener: ModuleListener.testStarted(android.security.cts.BannedFilesTest#testNoSetuidTcpdump)
     49 03-13 22:29:39 D/ModuleListener: ModuleListener.testEnded(android.security.cts.BannedFilesTest#testNoSetuidTcpdump, {})
     50 03-13 22:29:39 I/ConsoleReporter: [11/110 armeabi-v7a CtsSecurityTestCases chromeos2-row4-rack7-host11:22] android.security.cts.BannedFilesTest#testNoSetuidTcpdump pass
     51 03-13 22:29:39 D/ModuleListener: ModuleListener.testStarted(android.security.cts.BannedFilesTest#testNoSu)
     52 03-13 22:29:39 D/ModuleListener: ModuleListener.testEnded(android.security.cts.BannedFilesTest#testNoSu, {})
     53 03-13 22:29:39 I/ConsoleReporter: [12/110 armeabi-v7a CtsSecurityTestCases chromeos2-row4-rack7-host11:22] android.security.cts.BannedFilesTest#testNoSu pass
     54 03-13 22:29:39 D/ModuleListener: ModuleListener.testStarted(android.security.cts.BannedFilesTest#testNoSuInPath)
     55 03-13 22:29:39 D/ModuleListener: ModuleListener.testEnded(android.security.cts.BannedFilesTest#testNoSuInPath, {})
     56 03-13 22:29:39 I/ConsoleReporter: [13/110 armeabi-v7a CtsSecurityTestCases chromeos2-row4-rack7-host11:22] android.security.cts.BannedFilesTest#testNoSuInPath pass
     57 03-13 22:29:39 D/ModuleListener: ModuleListener.testStarted(android.security.cts.BannedFilesTest#testNoSunxiDebug)
     58 03-13 22:29:39 D/ModuleListener: ModuleListener.testEnded(android.security.cts.BannedFilesTest#testNoSunxiDebug, {})
     59 03-13 22:29:39 I/ConsoleReporter: [14/110 armeabi-v7a CtsSecurityTestCases chromeos2-row4-rack7-host11:22] android.security.cts.BannedFilesTest#testNoSunxiDebug pass
     60 03-13 22:29:39 D/ModuleListener: ModuleListener.testStarted(android.security.cts.BannedFilesTest#testNoSyncAgent)
     61 03-13 22:29:39 D/ModuleListener: ModuleListener.testEnded(android.security.cts.BannedFilesTest#testNoSyncAgent, {})
     62 03-13 22:29:39 I/ConsoleReporter: [15/110 armeabi-v7a CtsSecurityTestCases chromeos2-row4-rack7-host11:22] android.security.cts.BannedFilesTest#testNoSyncAgent pass
     63 03-13 22:29:39 D/ModuleListener: ModuleListener.testStarted(android.security.cts.BannedFilesTest#testNoSystemCmdSocket)
     64 03-13 22:29:39 D/ModuleListener: ModuleListener.testEnded(android.security.cts.BannedFilesTest#testNoSystemCmdSocket, {})
     65 03-13 22:29:39 I/ConsoleReporter: [16/110 armeabi-v7a CtsSecurityTestCases chromeos2-row4-rack7-host11:22] android.security.cts.BannedFilesTest#testNoSystemCmdSocket pass
     66 03-13 22:29:39 D/ModuleListener: ModuleListener.testStarted(android.security.cts.BitmapFactoryDecodeStreamTest#testNinePatchHeapOverflow)
     67 03-13 22:29:39 D/ModuleListener: ModuleListener.testEnded(android.security.cts.BitmapFactoryDecodeStreamTest#testNinePatchHeapOverflow, {})
     68 03-13 22:29:39 I/ConsoleReporter: [17/110 armeabi-v7a CtsSecurityTestCases chromeos2-row4-rack7-host11:22] android.security.cts.BitmapFactoryDecodeStreamTest#testNinePatchHeapOverflow pass
     69 03-13 22:29:39 D/ModuleListener: ModuleListener.testStarted(android.security.cts.BrowserTest#testBrowserPrivateDataAccess)
     70 03-13 22:29:44 D/ModuleListener: ModuleListener.testEnded(android.security.cts.BrowserTest#testBrowserPrivateDataAccess, {})
     71 03-13 22:29:44 I/ConsoleReporter: [18/110 armeabi-v7a CtsSecurityTestCases chromeos2-row4-rack7-host11:22] android.security.cts.BrowserTest#testBrowserPrivateDataAccess pass
     72 03-13 22:29:44 D/ModuleListener: ModuleListener.testStarted(android.security.cts.BrowserTest#testTabExhaustion)
     73 03-13 22:29:44 D/ModuleListener: ModuleListener.testEnded(android.security.cts.BrowserTest#testTabExhaustion, {})
     74 03-13 22:29:44 I/ConsoleReporter: [19/110 armeabi-v7a CtsSecurityTestCases chromeos2-row4-rack7-host11:22] android.security.cts.BrowserTest#testTabExhaustion pass
     75 03-13 22:29:44 D/ModuleListener: ModuleListener.testStarted(android.security.cts.BrowserTest#testTabReuse)
     76 03-13 22:29:44 D/ModuleListener: ModuleListener.testEnded(android.security.cts.BrowserTest#testTabReuse, {})
     77 03-13 22:29:44 I/ConsoleReporter: [20/110 armeabi-v7a CtsSecurityTestCases chromeos2-row4-rack7-host11:22] android.security.cts.BrowserTest#testTabReuse pass
     78 03-13 22:29:44 D/ModuleListener: ModuleListener.testStarted(android.security.cts.CertificateTest#testBlockCertificates)
     79 03-13 22:29:44 D/ModuleListener: ModuleListener.testEnded(android.security.cts.CertificateTest#testBlockCertificates, {})
     80 03-13 22:29:44 I/ConsoleReporter: [21/110 armeabi-v7a CtsSecurityTestCases chromeos2-row4-rack7-host11:22] android.security.cts.CertificateTest#testBlockCertificates pass
     81 03-13 22:29:44 D/ModuleListener: ModuleListener.testStarted(android.security.cts.CertificateTest#testNoAddedCertificates)
     82 03-13 22:29:45 D/ModuleListener: ModuleListener.testEnded(android.security.cts.CertificateTest#testNoAddedCertificates, {})
     83 03-13 22:29:45 I/ConsoleReporter: [22/110 armeabi-v7a CtsSecurityTestCases chromeos2-row4-rack7-host11:22] android.security.cts.CertificateTest#testNoAddedCertificates pass
     84 03-13 22:29:45 D/ModuleListener: ModuleListener.testStarted(android.security.cts.CertificateTest#testNoRemovedCertificates)
     85 03-13 22:29:45 D/ModuleListener: ModuleListener.testEnded(android.security.cts.CertificateTest#testNoRemovedCertificates, {})
     86 03-13 22:29:45 I/ConsoleReporter: [23/110 armeabi-v7a CtsSecurityTestCases chromeos2-row4-rack7-host11:22] android.security.cts.CertificateTest#testNoRemovedCertificates pass
     87 03-13 22:29:45 D/ModuleListener: ModuleListener.testStarted(android.security.cts.CharDeviceTest#testExynosKernelMemoryRead)
     88 03-13 22:29:45 D/ModuleListener: ModuleListener.testEnded(android.security.cts.CharDeviceTest#testExynosKernelMemoryRead, {})
     89 03-13 22:29:45 I/ConsoleReporter: [24/110 armeabi-v7a CtsSecurityTestCases chromeos2-row4-rack7-host11:22] android.security.cts.CharDeviceTest#testExynosKernelMemoryRead pass
     90 03-13 22:29:45 D/ModuleListener: ModuleListener.testStarted(android.security.cts.CharDeviceTest#testExynosRootingVuln)
     91 03-13 22:29:45 D/ModuleListener: ModuleListener.testEnded(android.security.cts.CharDeviceTest#testExynosRootingVuln, {})
     92 03-13 22:29:45 I/ConsoleReporter: [25/110 armeabi-v7a CtsSecurityTestCases chromeos2-row4-rack7-host11:22] android.security.cts.CharDeviceTest#testExynosRootingVuln pass
     93 03-13 22:29:45 D/ModuleListener: ModuleListener.testStarted(android.security.cts.ClonedSecureRandomTest#testCheckForDuplicateOutput)
     94 03-13 22:30:46 D/ModuleListener: ModuleListener.testEnded(android.security.cts.ClonedSecureRandomTest#testCheckForDuplicateOutput, {})
     95 03-13 22:30:46 I/ConsoleReporter: [26/110 armeabi-v7a CtsSecurityTestCases chromeos2-row4-rack7-host11:22] android.security.cts.ClonedSecureRandomTest#testCheckForDuplicateOutput pass
     96 03-13 22:30:46 D/ModuleListener: ModuleListener.testStarted(android.security.cts.ConscryptIntermediateVerificationTest#testIntermediateVerification)
     97 03-13 22:30:46 D/ModuleListener: ModuleListener.testEnded(android.security.cts.ConscryptIntermediateVerificationTest#testIntermediateVerification, {})
     98 03-13 22:30:46 I/ConsoleReporter: [27/110 armeabi-v7a CtsSecurityTestCases chromeos2-row4-rack7-host11:22] android.security.cts.ConscryptIntermediateVerificationTest#testIntermediateVerification pass
     99 03-13 22:30:46 D/ModuleListener: ModuleListener.testStarted(android.security.cts.DeviceIdleControllerTest#testAddWhiteList)
    100 03-13 22:31:04 D/BackgroundDeviceAction: Sleep for 5000 before starting logcat for chromeos2-row4-rack7-host11:22.
    101 03-13 22:31:04 I/InstrumentationResultParser: test run failed: 'Test run failed to complete. Expected 110 tests, received 27'
    102 03-13 22:31:04 D/ModuleListener: ModuleListener.testFailed(android.security.cts.DeviceIdleControllerTest#testAddWhiteList, Test failed to run to completion. Reason: 'Test run failed to complete. Expected 110 tests, received 27'. Check device logcat for details)
    103 03-13 22:31:04 I/ConsoleReporter: [28/110 armeabi-v7a CtsSecurityTestCases chromeos2-row4-rack7-host11:22] android.security.cts.DeviceIdleControllerTest#testAddWhiteList fail: Test failed to run to completion. Reason: 'Test run failed to complete. Expected 110 tests, received 27'. Check device logcat for details
    104 03-13 22:31:04 I/FailureListener: FailureListener.testFailed android.security.cts.DeviceIdleControllerTest#testAddWhiteList false true false
    105 03-13 22:31:06 D/FileUtil: Creating temp file at /tmp/autotest-tradefed-install_NSzXkp/6788ea8941996ab9d36f560c87b93484/android-cts-7.1_r3-linux_x86-arm/android-cts/tools/../../android-cts/logs/2017.03.13_22.28.26 with prefix "android.security.cts.DeviceIdleControllerTest#testAddWhiteList-logcat_" suffix ".zip"
    106 03-13 22:31:06 I/LogFileSaver: Saved log file /tmp/autotest-tradefed-install_NSzXkp/6788ea8941996ab9d36f560c87b93484/android-cts-7.1_r3-linux_x86-arm/android-cts/tools/../../android-cts/logs/2017.03.13_22.28.26/android.security.cts.DeviceIdleControllerTest#testAddWhiteList-logcat_7952032834779047236.zip
    107 03-13 22:31:06 I/ResultReporter: Saved logs for android.security.cts.DeviceIdleControllerTest#testAddWhiteList-logcat in /tmp/autotest-tradefed-install_NSzXkp/6788ea8941996ab9d36f560c87b93484/android-cts-7.1_r3-linux_x86-arm/android-cts/tools/../../android-cts/logs/2017.03.13_22.28.26/android.security.cts.DeviceIdleControllerTest#testAddWhiteList-logcat_7952032834779047236.zip
    108 03-13 22:31:06 D/FileUtil: Creating temp file at /tmp/3764431/cts/inv_1639864655957132693 with prefix "android.security.cts.DeviceIdleControllerTest#testAddWhiteList-logcat_" suffix ".zip"
    109 03-13 22:31:06 D/RunUtil: Running command with timeout: 10000ms
    110 03-13 22:31:06 D/RunUtil: Running [chmod]
    111 03-13 22:31:06 D/RunUtil: [chmod] command failed. return code 1
    112 03-13 22:31:06 D/FileUtil: Attempting to chmod /tmp/3764431/cts/inv_1639864655957132693/android.security.cts.DeviceIdleControllerTest#testAddWhiteList-logcat_6633338750974835141.zip to ug+rwx
    113 03-13 22:31:06 D/RunUtil: Running command with timeout: 10000ms
    114 03-13 22:31:06 D/RunUtil: Running [chmod, ug+rwx, /tmp/3764431/cts/inv_1639864655957132693/android.security.cts.DeviceIdleControllerTest#testAddWhiteList-logcat_6633338750974835141.zip]
    115 03-13 22:31:06 I/FileSystemLogSaver: Saved log file /tmp/3764431/cts/inv_1639864655957132693/android.security.cts.DeviceIdleControllerTest#testAddWhiteList-logcat_6633338750974835141.zip
    116 03-13 22:31:06 D/ModuleListener: ModuleListener.testEnded(android.security.cts.DeviceIdleControllerTest#testAddWhiteList, {})
    117 03-13 22:31:06 D/ModuleListener: ModuleListener.testRunFailed(Test run failed to complete. Expected 110 tests, received 27)
    118 03-13 22:31:06 I/ConsoleReporter: [chromeos2-row4-rack7-host11:22] Test run failed to complete. Expected 110 tests, received 27
    119 03-13 22:31:06 D/ModuleListener: ModuleListener.testRunEnded(0, {})
    120 03-13 22:31:06 I/ConsoleReporter: [chromeos2-row4-rack7-host11:22] armeabi-v7a CtsSecurityTestCases failed in 0 ms. 27 passed, 1 failed, 82 not executed
    121 03-13 22:31:06 I/AndroidNativeDeviceStateMonitor: Waiting for device chromeos2-row4-rack7-host11:22 to be ONLINE; it is currently NOT_AVAILABLE...
    122 03-13 22:31:09 D/BackgroundDeviceAction: Waiting for device chromeos2-row4-rack7-host11:22 online before starting.
    123 03-13 22:31:11 I/AndroidNativeDevice: Attempting recovery on chromeos2-row4-rack7-host11:22
    124 03-13 22:31:11 I/WaitDeviceRecovery: Pausing for 5000 for chromeos2-row4-rack7-host11:22 to recover
    125 03-13 22:31:16 I/AndroidNativeDeviceStateMonitor: Waiting for device chromeos2-row4-rack7-host11:22 to be ONLINE; it is currently NOT_AVAILABLE...
    126 03-13 22:32:16 W/TestInvocation: Invocation did not complete due to device chromeos2-row4-rack7-host11:22 becoming not available. Reason: Could not find device chromeos2-row4-rack7-host11:22
    127 03-13 22:32:16 W/ResultReporter: Invocation failed: com.android.tradefed.device.DeviceNotAvailableException: Could not find device chromeos2-row4-rack7-host11:22
    128 03-13 22:32:16 D/RunUtil: run interrupt allowed: false
    129 03-13 22:32:16 W/AndroidNativeDevice: AdbCommandRejectedException (device 'chromeos2-row4-rack7-host11:22' not found) when attempting shell ls "/sdcard/report-log-files/" on device chromeos2-row4-rack7-host11:22
    130 03-13 22:32:16 I/AndroidNativeDevice: Skipping recovery on chromeos2-row4-rack7-host11:22
    131 03-13 22:32:17 W/AndroidNativeDevice: AdbCommandRejectedException (device 'chromeos2-row4-rack7-host11:22' not found) when attempting shell ls "/sdcard/report-log-files/" on device chromeos2-row4-rack7-host11:22
    132 03-13 22:32:17 I/AndroidNativeDevice: Skipping recovery on chromeos2-row4-rack7-host11:22
    133 03-13 22:32:18 W/AndroidNativeDevice: AdbCommandRejectedException (device 'chromeos2-row4-rack7-host11:22' not found) when attempting shell ls "/sdcard/report-log-files/" on device chromeos2-row4-rack7-host11:22
    134 03-13 22:32:18 I/AndroidNativeDevice: Skipping recovery on chromeos2-row4-rack7-host11:22
    135 03-13 22:32:19 E/CollectorUtil: Caught exception during pull.
    136 03-13 22:32:19 E/CollectorUtil: Attempted shell ls "/sdcard/report-log-files/" multiple times on device chromeos2-row4-rack7-host11:22 without communication success. Aborting.
    137 com.android.tradefed.device.DeviceUnresponsiveException: Attempted shell ls "/sdcard/report-log-files/" multiple times on device chromeos2-row4-rack7-host11:22 without communication success. Aborting.
    138 	at com.android.tradefed.device.AndroidNativeDevice.performDeviceAction(AndroidNativeDevice.java:1550)
    139 	at com.android.tradefed.device.AndroidNativeDevice.executeShellCommand(AndroidNativeDevice.java:525)
    140 	at com.android.tradefed.device.AndroidNativeDevice.executeShellCommand(AndroidNativeDevice.java:565)
    141 	at com.android.tradefed.device.AndroidNativeDevice.doesFileExist(AndroidNativeDevice.java:893)
    142 	at com.android.compatibility.common.tradefed.util.CollectorUtil.pullFromDevice(CollectorUtil.java:55)
    143 	at com.android.compatibility.common.tradefed.targetprep.ReportLogCollector.tearDown(ReportLogCollector.java:98)
    144 	at com.android.tradefed.invoker.TestInvocation.doTeardown(TestInvocation.java:524)
    145 	at com.android.tradefed.invoker.TestInvocation.performInvocation(TestInvocation.java:451)
    146 	at com.android.tradefed.invoker.TestInvocation.invoke(TestInvocation.java:166)
    147 	at com.android.tradefed.command.CommandScheduler$InvocationThread.run(CommandScheduler.java:471)
    148 03-13 22:32:19 I/ResultReporter: Invocation finished in 3m 53s. PASSED: 27, FAILED: 1, NOT EXECUTED: 82, MODULES: 0 of 1
    149 03-13 22:32:28 I/ResultReporter: Test Result: /tmp/autotest-tradefed-install_NSzXkp/6788ea8941996ab9d36f560c87b93484/android-cts-7.1_r3-linux_x86-arm/android-cts/results/2017.03.13_22.28.26/test_result_failures.html
    150 03-13 22:32:28 I/ResultReporter: Full Result: /tmp/autotest-tradefed-install_NSzXkp/6788ea8941996ab9d36f560c87b93484/android-cts-7.1_r3-linux_x86-arm/android-cts/results/2017.03.13_22.28.26.zip
    151 
    152